Bioinformatics.org
[NEU MS in Health Informatics]
Not logged in
  • Log in
  • Bioinformatics.org
    Membership (37756+) Group hosting [?]
  • Wiki
  • Franklin Award
  • Sponsorships
  • Careers
    About bioinformatics
    Bioinformatics training
    Bioinformatics jobs

    Research
    All information groups
    Online databases Online analysis tools Online education tools More tools

    Development
    All software groups
    FTP repository
    SVN & CVS repositories [?]
    Mailing lists

    Forums
    News & Commentary
  • Submit
  • Archives
  • Subscribe

  • Jobs Forum
    (Career Center)
  • Submit
  • Archives
  • Subscribe
  • Ghemical: Molecular modelling - Message forums

    Discussion forums: Help

    Expanded view | Monitor forum | Save place

    Message
    Another Compile Error
    Submitted by Nobody; posted on Saturday, February 01, 2003
    Hello, I'm trying to compile on SuSE 8.1 but make always fails: ---snip----- geomopt_dialog.h:34: candidate is: static void geomopt_dialog::handler_ButtonOK(...) geomopt_dialog.cpp: In member function `void geomopt_dialog::handler_ButtonOK(GtkWidget*, void*)': geomopt_dialog.cpp:106: `class geomopt_dialog' has no member named `xml' geomopt_dialog.cpp:107: `class geomopt_dialog' has no member named `xml' geomopt_dialog.cpp:108: `class geomopt_dialog' has no member named `xml' geomopt_dialog.cpp:122: `class geomopt_dialog' has no member named ` entry_nsteps' geomopt_dialog.cpp:127: `class geomopt_dialog' has no member named `entry_grad' geomopt_dialog.cpp:132: `class geomopt_dialog' has no member named ` entry_delta_e' geomopt_dialog.cpp:185: `class geomopt_dialog' has no member named `dialog' geomopt_dialog.cpp: At global scope: geomopt_dialog.cpp:189: prototype for `void geomopt_dialog::handler_ButtonCancel(GtkWidget*, void*)' does not match any in class `geomopt_dialog' geomopt_dialog.h:35: candidate is: static void geomopt_dialog::handler_ButtonCancel(...) geomopt_dialog.cpp: In member function `void geomopt_dialog::handler_ButtonCancel(GtkWidget*, void*)': geomopt_dialog.cpp:195: `class geomopt_dialog' has no member named `dialog' make[1]: *** [geomopt_dialog.o] Fehler 1 make[1]: Verlassen des Verzeichnisses »/usr/src/packages/SOURCES/ghemical-1.00/src/target3/glade« make: *** [all] Fehler 1 I'm using the standard packages incl. devel-packages provided by SuSE: gcc-3.2 f2c-0.11 make-3.79.1 mesaglut-4.0.3 gnome-libs-1.4.1.7 gtkglarea-1.2.2 mpqc-1.2.5 Anyone any idea how to fix? Downgrading gnome? Thanks, Tim



    Post a followup to this message:
    You have to be logged in to post a reply.
    Thread view
    Another Compile Error
    Submitted by Nobody; posted on Saturday, February 01, 2003
    Hello, I'm trying to compile on SuSE 8.1 but make always fails: ---snip----- geomopt_dialog.h:34: candidate is: static void geomopt_dialog::handler_ButtonOK(...) geomopt_dialog.cpp: In member function `void geomopt_dialog::handler_ButtonOK(GtkWidget*, void*)': geomopt_dialog.cpp:106: `class geomopt_dialog' has no member named `xml' geomopt_dialog.cpp:107: `class geomopt_dialog' has no member named `xml' geomopt_dialog.cpp:108: `class geomopt_dialog' has no member named `xml' geomopt_dialog.cpp:122: `class geomopt_dialog' has no member named ` entry_nsteps' geomopt_dialog.cpp:127: `class geomopt_dialog' has no member named `entry_grad' geomopt_dialog.cpp:132: `class geomopt_dialog' has no member named ` entry_delta_e' geomopt_dialog.cpp:185: `class geomopt_dialog' has no member named `dialog' geomopt_dialog.cpp: At global scope: geomopt_dialog.cpp:189: prototype for `void geomopt_dialog::handler_ButtonCancel(GtkWidget*, void*)' does not match any in class `geomopt_dialog' geomopt_dialog.h:35: candidate is: static void geomopt_dialog::handler_ButtonCancel(...) geomopt_dialog.cpp: In member function `void geomopt_dialog::handler_ButtonCancel(GtkWidget*, void*)': geomopt_dialog.cpp:195: `class geomopt_dialog' has no member named `dialog' make[1]: *** [geomopt_dialog.o] Fehler 1 make[1]: Verlassen des Verzeichnisses »/usr/src/packages/SOURCES/ghemical-1.00/src/target3/glade« make: *** [all] Fehler 1 I'm using the standard packages incl. devel-packages provided by SuSE: gcc-3.2 f2c-0.11 make-3.79.1 mesaglut-4.0.3 gnome-libs-1.4.1.7 gtkglarea-1.2.2 mpqc-1.2.5 Anyone any idea how to fix? Downgrading gnome? Thanks, Tim
    Another Compile Error
    Submitted by Nobody; posted on Friday, April 11, 2003
    Hi. Looks like a simple error, but is not. It says `class geomopt_dialog' has no member named `xml' but sure there should be such a member. Sorry, but I have never seen such an error and I can't tell where it comes. Regards, Tommi

     

    Copyright © 2016 · Scilico, LLC